[ecasound] CVS compile error (ecasignalview)

From: Stephen Stocker <lpar@email-addr-hidden>
Date: Tue Aug 23 2005 - 02:15:02 EEST


   I've been getting an error trying to compile Ecasound CVS for the past 2
weeks or so. I'm using Slackware 10, gcc 3.3.4 with glibc 2.3.2.

   It fails with the following error:

if g++ -DHAVE_CONFIG_H -I. -I. -I.. -I. -I.. -I../kvutils -I../libecasound -I../
libecasoundc -D_REENTRANT -ffast-math -fstrict-aliasing -funroll-loops -DNDEBUG
  -DENABLE_DBC -g -O2 -MT ecasignalview.o -MD -MP -MF ".deps/ecasignalview.Tpo" -
c -o ecasignalview.o ecasignalview.cpp; \
then mv -f ".deps/ecasignalview.Tpo" ".deps/ecasignalview.Po"; else rm -f ".deps
/ecasignalview.Tpo"; exit 1; fi
ecasignalview.cpp: In function `void ecasv_output_init()':
ecasignalview.cpp:337: error: invalid conversion from `const char*' to `char*'
ecasignalview.cpp:343: error: invalid conversion from `const char*' to `char*'
make[2]: *** [ecasignalview.o] Error 1
make[2]: Leaving directory `/home/lpar/temp-work/ecasound/ecatools'
make[1]: *** [all-recursive] Error 1
make[1]: Leaving directory `/home/lpar/temp-work/ecasound'
make: *** [all] Error 2

   Thanks for any help anyone can offer, and thank you for a great software


SF.Net email is Sponsored by the Better Software Conference & EXPO
September 19-22, 2005 * San Francisco, CA * Development Lifecycle Practices
Agile & Plan-Driven Development * Managing Projects & Teams * Testing & QA
Security * Process Improvement & Measurement * http://www.sqe.com/bsce5sf
Ecasound-list mailing list
Received on Tue Aug 23 08:15:09 2005

This archive was generated by hypermail 2.1.8 : Tue Aug 23 2005 - 08:15:10 EEST