Re: [ecasound] Compile Error on OSX

From: Ben Powers <bennyp@email-addr-hidden>
Date: Wed Mar 23 2005 - 22:41:09 EET

I am trying to use gentoo-macos to install ecasound and ecamegapedal.
I have gotten this same error from 2.3.2 and 2.3.3. Has any progress
been made since july 2004?

  c++ -DHAVE_CONFIG_H -I. -I. -I.. -I. -I../kvutils -O2 -pipe
-D_REENTRANT -D_REENTRANT -ffast-math -fstrict-aliasing -funroll-loops
-DNDEBUG -DENABLE_DBC -c eca-chainsetup.cpp -o eca-chainsetup.o
eca-chainsetup.cpp: In member function `void
eca-chainsetup.cpp:616: error: `::mlockall' undeclared (first use here)
eca-chainsetup.cpp:616: error: `MCL_CURRENT' undeclared (first use this
eca-chainsetup.cpp:616: error: (Each undeclared identifier is reported
    once for each function it appears in.)
eca-chainsetup.cpp:616: error: `MCL_FUTURE' undeclared (first use this
eca-chainsetup.cpp: In member function `void
eca-chainsetup.cpp:635: error: `::munlockall' undeclared (first use
make[3]: *** [eca-chainsetup.lo] Error 1
make[2]: *** [all-recursive] Error 1
make[1]: *** [all-recursive] Error 1
make: *** [all-recursive-am] Error 2
End religious persecution in China!
Join Friends of Falun Gong

This email is sponsored by Microsoft Mobile & Embedded DevCon 2005
Attend MEDC 2005 May 9-12 in Vegas. Learn more about the latest Windows
Embedded(r) & Windows Mobile(tm) platforms, applications & content. Register
by 3/29 & save $300
Ecasound-list mailing list
Received on Thu Mar 24 12:15:05 2005

This archive was generated by hypermail 2.1.8 : Thu Mar 24 2005 - 12:15:06 EET