[ecasound] 1.6.3d6: compile errors

New Message Reply Date view Thread view Subject view Author view Other groups

Subject: [ecasound] 1.6.3d6: compile errors
From: Jeremy Hall (jhall@uu.net )
Date: Wed Nov 17 1999 - 01:02:50 EET


Hello,

I tried to build ecasound without alsa and without qt support from the tar
ecasound-1.6.3d6.tar.gz and got these errors.

make[2]: Leaving directory
`/src/sound/ecasound/ecasound-1.6.3d6/libecasound'
Making all in ecasound
make[2]: Entering directory
`/src/sound/ecasound/ecasound-1.6.3d6/ecasound'
c++ -DHAVE_CONFIG_H -I. -I. -I.. -I. -I../libecasound/include -I../kvutils
-O2 -D_REENTRANT -DNDEBUG -ffast-math -c eca-text.cpp
eca-text.cpp:28: ecasound/eca-iamode-parser.h: No such file or directory
eca-text.cpp:29: ecasound/eca-controller.h: No such file or directory
eca-text.cpp:30: ecasound/eca-session.h: No such file or directory
eca-text.cpp:31: ecasound/eca-main.h: No such file or directory
eca-text.cpp:32: ecasound/eca-version.h: No such file or directory
eca-text.cpp:33: ecasound/eca-debug.h: No such file or directory
eca-text.cpp:34: ecasound/eca-error.h: No such file or directory
make[2]: *** [eca-text.o] Error 1
make[2]: Leaving directory `/src/sound/ecasound/ecasound-1.6.3d6/ecasound'
make[1]: *** [all-recursive] Error 1
make[1]: Leaving directory `/src/sound/ecasound/ecasound-1.6.3d6'
make: *** [all-recursive-am] Error 2

_J


New Message Reply Date view Thread view Subject view Author view Other groups

This archive was generated by hypermail 2a24 : Wed Nov 17 1999 - 01:22:11 EET